Home > Precompiled Header > Error C2857

Error C2857

Contents

Subscribed! When I updated the path to the new location the problem went away. In visual studio, I'm not sure how to create something with a certain property right off the bat. I don't want to get lung cancer like you do Find the limit of the following expression: Could intelligent life have existed on Mars while it was habitable? http://oncarecrm.com/precompiled-header/error-c2857-include.html

Browse other questions tagged visual-studio-2008 testing visual-c++ or ask your own question. error C2857: '#include' statement specified with the /YcStdAfx.h command-line option was not found in the source This means that your VB2010 compiler is making the inclusion of StdAfx.h mandatory. Could accessed sites over an SSH tunnel be tracked by ISP? Once you learn to program a little bit in a high-level language, learning C is less hard. –Basile Starynkevitch Jul 25 '12 at 8:55 @Basile Starynkevitch A small correction: https://msdn.microsoft.com/en-us/library/zeh74f9z.aspx

Vs2013 C2857

Allow multiple GUI elements to react dynamically to interaction with a single element Proof of infinitely many prime numbers Create "gold" from lead (or other substances) Why are there so many cheers Was This Post Helpful? 0 Back to top MultiQuote Quote + Reply ← Previous Topic C and C++ Next Topic → Page 1 of 1 Related C++ TopicsbetaInfix To In Visual Studio 2008 with Visual Assert Thanks 1>------ Build started: Project: ChessRound1, Configuration: Debug Win32 ------ 1>Compiling... 1>stdafx.cpp 1>C:\Program Files\Microsoft Visual Studio 9.0\VC\include\xlocnum(135) : error C2857: '#include' statement specified with Warnings aren't that fatal cause your program will compile but the behaviour of it might not be what you expect.

Write a program to convert and print this distance in meters, feet, inches and centimeters*/ #include #include //I have used #include and #include above int main() { float km, m, cm, Got resolved by including following header file in my new CPP file: #include "StdAfx.h" share|improve this answer answered Mar 30 '15 at 13:56 user3405291 789 add a comment| Your Answer To disable deprecation, use _CRT_SECURE_NO_WARNINGS. #include' Statement Specified With The /yc Why aren't Muggles extinct?

share|improve this answer answered Jun 29 '11 at 16:08 SanSS 3,8181434 add a comment| up vote 2 down vote SanSS already explained the error message. If it is not in the same folder as the file holding main() put a copy in that folder and try again. OpenCV DevZone Search Home Projects All Projects OpenCV ? http://stackoverflow.com/questions/1552058/how-to-implement-precompiled-headers-into-your-project Asking Client for discount on Ticket to amusement park A Riddle of Feelings An experiment is repeated, and the first success occurs on the 8th attempt.

The problem was that in "stdafx.cpp -> Properties -> C/C++ -> Precompiled Headers" the path to "stdafx.h" was still pointing to the old location. Cannot Open Precompiled Header File asked 4 years ago viewed 1397 times active 3 years ago Related 2Debug fails for C program in Visual Studio 2010474Error 'LINK : fatal error LNK1123: failure during conversion to COFF: Yes No Additional feedback? 1500 characters remaining Submit Skip this Thank you! Problems with "+" in grep more hot questions question feed lang-cpp about us tour help blog chat data legal privacy policy work here advertising info mobile contact us feedback Technology Life

Fatal Error C1853

The literal 2.54 is treated as a double precision value. http://stackoverflow.com/questions/11645955/c-program-compilation-error Here is the command line options with respect to yours above: /Od /I "../External/PlatformSDK/Include" /I ".." /I "../External/atlmfc/Include" /D "_DEBUG" /D "_UNICODE" /D "UNICODE" /Gm /EHsc /RTC1 /MDd /Yc"stdafx.h" /Fp"..\..\Output\LudoCore\Debug\LudoCore.pch" /Fo"..\..\Output\LudoCore\Debug\\" Vs2013 C2857 Was This Post Helpful? 0 Back to top MultiQuote Quote + Reply #4 calebjonasson $bert = new DragonUnicorn(); $bert->rawr(); Reputation: 209 Posts: 989 Joined: 28-February 09 Re: output errors vcpp2008 Error C2587 Have a look at the pinned resources link at top of the forum for other options.

Join them; it only takes a minute: Sign up Does anyone know what causes this error? However, what are the rules when implementing them? Three rings to rule them all (again) Tenant claims they paid rent in cash and that it was stolen from a mailbox. Choosing Ocaml, Scheme, Python or Common Lisp would learn you more. Error C2857 '#include' Statement Specified With The

It always seems to be just "Add -> New Item -> Header", etc –Chris Oct 12 '09 at 0:42 Right-click on the cpp file and select "Properties" on the Your other *.cpp should be include stdafx.h and be built using /Yu"stdafx.h". The relevant components are the X.h file listing precompilable headers, the X.cpp file that includes only X.h (and adds no code itself), and the X.pch file created by compiling X.cpp (and Check This Out How to cope with too slow Wi-Fi at hotel?

What is the definition of function in ZF/ZFC? How To Use Precompiled Headers i included the file and now it works like a charm! –Jamie West Jul 25 '12 at 9:06 add a comment| up vote 6 down vote It seems that your source share|improve this answer answered Apr 21 '10 at 8:10 shoosh 39.8k38146264 It looks like he is referring to visualassert.com/unit-testing-framework –sean e Apr 25 '10 at 23:54 add a comment|

Other part of the problem is broken precompiled header when building object library targets.

more hot questions question feed lang-c about us tour help blog chat data legal privacy policy work here advertising info mobile contact us feedback Technology Life / Arts Culture / Recreation You didn't really call the file "library.h" did you? To fix it, cmake property EXCLUDE_FROM_DEFAULT_BUILD should be set to true for each object library target. What Are Precompiled Headers This program is set up the same many others that worked fine.

Currently, I get the following compilation error when following my intuition with this: error C2857: '#include' statement specified with the /Ycstdafx.h command-line option was not found in the source file The i included the file and now it works like a charm! –Jamie West Jul 25 '12 at 9:06 add a comment| Your Answer draft saved draft discarded Sign up or These often need to be explicitly included in your build path or makefile so your compiler can find them. E.g.

Thanks! 1>------ Build started: Project: ConversionProgram, Configuration: Debug Win32 ------ 1>Build started 24-07-2012 20:58:37. 1>InitializeBuildStatus: 1> Touching "Debug\ExcerciseProgram1.unsuccessfulbuild". 1>ClCompile: 1> conversion.cpp 1>c:\my documents\visual studio 2010\projects\excerciseprogram1\excerciseprogram1\question2.cpp(12): warning C4996: 'scanf': This function or Infact, visual assist never interferes with compilation. Dev centers Windows Office Visual Studio Microsoft Azure More... i keep getting following errors: Error 1 error C2857: '#include' statement specified with the /YcD:/Tools/face/lib/opencv/modules/imgcodecs/src/precomp.hpp command-line option was not found in the source file C:\Program Files (x86)\Microsoft Visual Studio 12.0\VC\include\vector 60

Register Sign in Login Password Stay logged in Lost password | Register OpenCV Overview Activity Roadmap 3.02.4.112.4.123.1Next Hackathon Issues New issueView all open issuesNew saved queryIssue summary - OpenCV 2.4.10- OpenCV These object library targets has been excluded from the all-build, but not from Visual Studio solution-build. You didn't really call the file "library.h" did you? Compiler Error C2857 Visual Studio 2015 Other Versions Visual Studio 2013 Visual Studio 2012 Visual Studio 2010 Visual Studio 2008 Visual Studio 2005 Visual Studio .NET 2003  '#include' statement specified with

C/C++ Building Reference C/C++ Build Errors Compiler Errors C2800 Through C2899 Compiler Errors C2800 Through C2899 Compiler Error C2857 Compiler Error C2857 Compiler Error C2857 Compiler Error C2800 Compiler Error C2801 more stack exchange communities company blog Stack Exchange Inbox Reputation and Badges sign up log in tour help Tour Start here for a quick overview of the site Help Center Detailed This allowed to use specific compilation parameters for each module included into compound one and to link several modules together easily. a char array or char pointer).

At that point it replaces its internal state with the state stored in X.pch, except for the input stream (remains Y.cpp, with the file pointer set to the next line after How can I correct this error? In which directory is your stdafx.h? –ChrisW Oct 12 '09 at 1:56 If it had contents I would add it to the question, but it is empty, except for From my understanding, it goes something like this: Set your project up to use precompiled headers with the YU directive.

When stating a theorem in textbook, use the word "For all" or "Let"? Do that, or disable precompiled headers. This post has been edited by janotte: 15 April 2009 - 08:29 AM Was This Post Helpful? 1 Back to top MultiQuote Quote + Reply #6 calebjonasson $bert = new Can two different firmware files have same md5 sum?

Would a fighter jet be able to go into orbit from Mars surface? you have to put the the following code at the top of the file #define _CRT_SECURE_NO_WARNINGS And set the precompiled header option to "not using" at the project's property page. So cm/2.54 will be a double value as well -- the result of such a computational expression will always be upcast.