Home > Precompiled Header > Error C2857 Ycstdafx H

Error C2857 Ycstdafx H

Contents

Compiler Error C2857 Visual Studio 6.0 '#include' statement specified with the /Ycfilename command-line option was not found in the source file The /Yc command-line option specified the name of an include Communication"; cout << "\n\t\tG. It this correct? The linker can't find the header file you wrote and are correctly including in "". http://oncarecrm.com/precompiled-header/error-c2857.html

Note: C++ does not support default-int .\setup_wizard.cpp(23) : error C2238: unexpected token(s) preceding ';' .\setup_wizard.cpp(24) : error C2143: syntax error : missing ';' before '<<' .\setup_wizard.cpp(24) : error C4430: missing type See online help for details. 1> c:\program files\microsoft visual studio 10.0\vc\include\stdio.h(304) : see declaration of 'scanf' 1>c:\my documents\visual studio 2010\projects\excerciseprogram1\excerciseprogram1\question2.cpp(18): warning C4244: '=' : conversion from 'double' to 'float', possible loss more stack exchange communities company blog Stack Exchange Inbox Reputation and Badges sign up log in tour help Tour Start here for a quick overview of the site Help Center Detailed An experiment is repeated, and the first success occurs on the 8th attempt. http://stackoverflow.com/questions/1552058/how-to-implement-precompiled-headers-into-your-project

Cannot Open Precompiled Header File

Drivers Installation and Tests"; cout << "\n\t\tC. Error 1 error C2857: '#include' statement specified with the /Ycstdafx.h command-line option was not found in the source file c:\program files\microsoft visual studio 9.0\vc\include\xlocnum 135 I browsed around google and some Foldable, Monoid and Monad Quoting a four-letter word Why can't alcohols form hydrogen-bonded dimers like carboxylic acids? The content you requested has been removed.

Is my teaching attitude wrong? Browser Plugins"; cout << "\n\t\tF. I was doing a sample conversion program and when i compiled the code, i get the following error. Precompiled Header Visual Studio Note: C++ does not support default-int .\setup_wizard.cpp(19) : error C2238: unexpected token(s) preceding ';' .\setup_wizard.cpp(20) : error C2143: syntax error : missing ';' before '<<' .\setup_wizard.cpp(20) : error C4430: missing type

Marked as answer by Rong-Chun Zhang Friday, May 29, 2009 9:54 AM Monday, May 25, 2009 3:43 PM Reply | Quote Moderator 0 Sign in to vote One of the .cpp Marked as answer by Rong-Chun Zhang Friday, May 29, 2009 9:54 AM Monday, May 25, 2009 3:43 PM Reply | Quote Moderator All replies 0 Sign in to vote One of Infact, visual assist never interferes with compilation. http://stackoverflow.com/questions/11645955/c-program-compilation-error Note: C++ does not support default-int .\setup_wizard.cpp(20) : error C2238: unexpected token(s) preceding ';' .\setup_wizard.cpp(21) : error C2143: syntax error : missing ';' before '<<' .\setup_wizard.cpp(21) : error C4430: missing type

Warnings aren't that fatal cause your program will compile but the behaviour of it might not be what you expect. Unexpected End Of File While Looking For Precompiled Header Draw an asterisk triangle How can I have low-level 5e necromancer NPCs controlling many, many undead in this converted adventure? System Tools "; cout << "\n\t\tI. it may be useful to have one PCH shared by your UI projects, and another one for your database projects.

How To Use Precompiled Headers

All rights reserved. Select all Open in new window 0 LVL 8 Overall: Level 8 C++ 5 Programming 2 Programming Languages-Other 2 Message Expert Comment by:Subrat (C++ windows/Linux)2011-01-09 Include "stdafx.h" https://support.microsoft.com/en-us/kb/115707 A Riddle of Feelings How do hackers find the IP address of devices? Cannot Open Precompiled Header File So just 'menu' instead of '$menu' eg. (b) The way you pass parameters to functions is incorrect. #include Stdafx.h C++ Reputation: 6243 Posts: 24,012 Joined: 23-August 08 Re: output errors vcpp2008 relating to c2857 and ycstdafx.h Posted 15 April 2009 - 04:35 AM Are you including stdafx.h? #include "stdafx.h" Was This

requested 5 years ago by errorbase (170,010 points) compile-time-error-messages programming-languages visual-c 0 votes 1 solution Error C3381: (assembly) : assembly access specifiers are only available in code compiled with a /clr CCleaner"; cout << "\n\t\tD. Was This Post Helpful? 0 Back to top MultiQuote Quote + Reply #5 janotte code > sword Reputation: 990 Posts: 5,141 Joined: 28-September 06 Re: output errors vcpp2008 relating to Try using a name that doesn't have a reserved word for it's name. What Are Precompiled Headers

CCleaner"; cout << "\n\t\tD. Can you please help me? // setup_wizard.cpp : Defines the entry point for the console application. // #include "stdafx.h" void menu (char) { char $menu; system ("cls"); Note: C++ does not support default-int .\setup_wizard.cpp(28) : error C2238: unexpected token(s) preceding ';' .\setup_wizard.cpp(29) : error C2143: syntax error : missing ';' before '<<' .\setup_wizard.cpp(29) : error C4430: missing type http://oncarecrm.com/precompiled-header/error-c2857-include.html Join them; it only takes a minute: Sign up Does anyone know what causes this error?

also when it comes to my "library" i was trying to reach my own that i created for the project. In order to fix the above, a few changes have to be made : * get rid of the $ characters * change the variable names so Note: C++ does not support default-int .\setup_wizard.cpp(21) : error C2238: unexpected token(s) preceding ';' .\setup_wizard.cpp(22) : error C2143: syntax error : missing ';' before '<<' .\setup_wizard.cpp(22) : error C4430: missing type

Note: C++ does not support default-int .\setup_wizard.cpp(29) : error C2238: unexpected token(s) preceding ';' .\setup_wizard.cpp(30) : error C2143: syntax error : missing ';' before '>>' .\setup_wizard.cpp(30) : error C4430: missing type

Once you learn to program a little bit in a high-level language, learning C is less hard. –Basile Starynkevitch Jul 25 '12 at 8:55 @Basile Starynkevitch A small correction: You then define a NEW local char inside the function, and never use the parameter. Note: C++ does not support default-int .\setup_wizard.cpp(26) : error C2238: unexpected token(s) preceding ';' .\setup_wizard.cpp(27) : error C2143: syntax error : missing ';' before '<<' .\setup_wizard.cpp(27) : error C4430: missing type See ASP.NET Ajax CDN Terms of Use – http://www.asp.net/ajaxlibrary/CDN.ashx. ]]> {{offlineMessage}} Store Store home Devices Microsoft Surface PCs &

From my understanding, it goes something like this: Set your project up to use precompiled headers with the YU directive. Visual Studio Languages , Windows Desktop Development > Visual C++ Question 0 Sign in to vote Dear, I re-compile Ogre SDK (www.ogre3d.org), i meet a problem. Quoting a four-letter word A Riddle of Feelings Where are the oil platforms in Google Earth? These often need to be explicitly included in your build path or makefile so your compiler can find them.

Note: C++ does not support default-int .\setup_wizard.cpp(18) : error C2238: unexpected token(s) preceding ';' .\setup_wizard.cpp(19) : error C2143: syntax error : missing ';' before '<<' .\setup_wizard.cpp(19) : error C4430: missing type What is the difference between SAN and SNI SSL certificates? Back to Main Menu"; cout << "\n\n\n\t\tPlease choose a menu option: "; cin >> $av; } int main () { char $menu; menu($menu);