Home > Error C4430 > Error C4430

Error C4430

Contents

Make sure to include the file defining DWORDLONG before in Initialization.h. share|improve this answer answered Mar 3 '13 at 13:59 Joseph Mansfield 73.9k9133228 just added a return 0 to the end of the main, still has the same problem. –Rehan contact us 12,526,129 members (32,218 online) Sign in Email Password Forgot your password? Error 1 *error C4430: missing type specifier - int assumed. Check This Out

Compiler Warning C4430 Visual Studio 2015 Other Versions Visual Studio 2013 Visual Studio 2012 Visual Studio 2010 Visual Studio 2008 Visual Studio 2005  missing type specifier - int assumed. See the example I gave. –Joseph Mansfield Mar 3 '13 at 14:04 ok thanks mate works now. Note: C++ does not support default-int (..\Classes\Officer.cpp) f:\documents\apps\prisonbreak\classes\playscene.h 39 1 PrisonBreak > Error 29 error C2061: syntax error : identifier 'Point' (..\Classes\Officer.cpp) f:\documents\apps\prisonbreak\classes\playscene.h 39 1 PrisonBreak > Error 31 error C2061: It is usually considered good practice that include files include the things that they are using by themselves. http://stackoverflow.com/questions/15186416/c-compiler-error-c4430-c-doesnt-support-default-int

Error C2143

SafarTimura 4-Apr-11 9:37am This is correct, they changed the standard so you must specific the return type from a function. Try to add a class declaration before the main function... Make sure WinPcap is installed.\n"); return -1; } Posted 5-May-13 21:18pm decayer23267 Updated 5-May-13 21:37pm Jochen Arndt144K v4 Add a Solution Comments Sergey Alexandrovich Kryukov 6-May-13 3:24am In what to elaborate a bit more, C used to support not explicitly defining a return type, C++ doesn't support this.

more hot questions lang-cpp about us tour help blog chat data legal privacy policy work here advertising info mobile contact us feedback Technology Life / Arts Culture / Recreation Science Other I replaced all the ifndef with #progma once. I've also added a return type to main. –TheLazyChap Mar 3 '13 at 14:08 add a comment| Not the answer you're looking for? Error C4430 Missing Type Specifier Constructor Related Sites Visual Studio Visual Studio Integrate VSIP Program Microsoft .NET Microsoft Azure Connect Forums Blog Facebook LinkedIn Stack Overflow Twitter Visual Studio Events YouTube Developer Resources Code samples Documentation Downloads

Ask a question Quick access Forums home Browse forums users FAQ Search related threads Remove From My Forums Answered by: error C4430 - can someone help? Error C4430 Missing Type Specifier Same goes for when you want to "cout", in an ide it seems i have to do "std::cout" whereas in a text editor i could just do "cout" without the pre Note: C++ does not support default-int" I am completely new to C++.   I'd appreciate if could help me spot the source of my error in the following program:

As Jonathan already reported, Under "Show directories for:" dropdown, select "Include files" and remove the "C:\Program Files\Microsoft Visual Studio\VC98\Include" Tuesday, February 08, 2011 11:33 AM Reply | Quote Microsoft is conducting an online survey to

What news about the second Higgs mode (or the mysterious particle) is anticipated to be seen at LHC around 750 GeV? C2061 C2143 C4430 How to cope with too slow Wi-Fi at hotel? decayer23 6-May-13 4:24am Thanks. i include the class.but i got the error.

Error C4430 Missing Type Specifier

more stack exchange communities company blog Stack Exchange Inbox Reputation and Badges sign up log in tour help Tour Start here for a quick overview of the site Help Center Detailed int MyFunc() { return 0; } or void MyFunc() { } is the right one. Error C2143 If you choose to participate, the online survey will be presented to you when you leave the Msdn Web site.Would you like to participate? Error C4430 Visual C++ Dev centers Windows Office Visual Studio Microsoft Azure More...

What are the drawbacks of the US making tactical first use of nuclear weapons against terrorist sites? http://oncarecrm.com/error-c4430/error-c4430-directx.html here is the code: #include #include #include #include #include using namespace std; inline void keep_window_open() { char ch; cin >> ch; } main() { cout << However, your Initialization.cpp includes Initialization.h first and then includes ../Main/EngineStd.h which defines the Windows specific stuff. googling for 'C4430' would lead you here. Error C4430 Visual Studio

It seems you include Initialization.h which uses DWORDLONG but that has not been defined yet. Note: C++ does not support default-int Home Categories FAQ/Guidelines Terms of Service Privacy Policy Powered by Discourse, best viewed with JavaScript enabled Search: Forum Windows Programming Note: C++ does not support Note: C++ does not support default-int 1>c:\users\speedserver\documents\visual studio 2008\projects\oop\oop\book.h(15) : warning C4183: 'getAUTHOR': missing return type; assumed to be a member function returning 'int' 1>c:\users\speedserver\documents\visual studio 2008\projects\oop\oop\book.h(16) : error C2146: syntax http://oncarecrm.com/error-c4430/error-c4430-int.html int const drive = _getdrive(); struct _diskfree_t diskfree; _getdiskfree(drive, &diskfree); unsigned __int64 const neededClusters = diskSpaceNeeded /(diskfree.sectors_per_cluster*diskfree.bytes_per_sector); if (diskfree.avail_clusters < neededClusters) { // if you get here you don’t have enough

The content you requested has been removed. C4430 Missing Type Specifier - Int Assumed Your current solution might work but it will give you a headache when you try to include Initialization.h somewhere else and don't remember which other includes it requires. Browse other questions tagged c++ vs2010-express or ask your own question.

Your Email This email is in use.

Note: C++ does not support default-int 1>c:\users\speedserver\documents\visual studio 2008\projects\oop\oop\book.h(16) : warning C4183: 'getTITLE': missing return type; assumed to be a member function returning 'int' 1>c:\users\speedserver\documents\visual studio 2008\projects\oop\oop\book.h(17) : error C2146: syntax Note: C++ does not support default-int (..\Classes\Officer.cpp) f:\documents\apps\prisonbreak\classes\playscene.h 11 1 PrisonBreak > Error 20 error C2143: syntax error : missing ';' before '*' (..\Classes\Officer.cpp) f:\documents\apps\prisonbreak\classes\playscene.h 15 1 PrisonBreak > Error 21 Browse other questions tagged c++ or ask your own question. C4430 Missing Type Specifier - Int Assumed. Note C++ Does Not Support Default-int i have searched the error and it happens for many people but it still didnt explain my case.

Can a class instance variable be excluded from a subclass in Java? Make a suggestion Dev centers Windows Office Visual Studio Microsoft Azure More... However, the error is from the linker telling you that it can not find the packet_handler() function in object files (created by compiling source files) or a library. navigate here Your Email Password Forgot your password?

Note: C++ does not support default-int 1>c:\users\speedserver\documents\visual studio 2008\projects\oop\oop\book.h(16) : error C4430: missing type specifier - int assumed. Note: C++ does not support default-int1C++ error C4430 int assumed0srand(time(NULL)): error C4430: missing type specifier - int assumed. All implementations shall allow both — a function of () returning int and — a function of (int, pointer to pointer to char) returning int as the type of main (8.3.5). Do you need your password?

please help me><1>c:\users\jenny\documents\visual studio 2012\projects\face detection 1\face detection 1\source.cpp(130): error C4430: missing type specifier - int assumed. Permalink Posted 1-Apr-11 21:16pm OriginalGriff1.7M Rate this: Please Sign up or sign in to vote. See @Vlad from Moscow's answer, too. –Dieter Lücking Apr 7 '15 at 18:08 add a comment| 1 Answer 1 active oldest votes up vote 3 down vote Function main shall have Join them; it only takes a minute: Sign up error C4430 : missing type specifier up vote 0 down vote favorite When trying to compile this project, I get 2 errors

Note: C++ does not support default-int-2Error 2 error C4430: missing type specifier - int assumed. Note: C++ does not support default-int* please help it's happening in all the code i create, even the small stuff. Can two different firmware files have same md5 sum? So just add the function as done there.

See more: C++ plz any one help me,why this types of error come. Terms of Service Layout: fixed | fluid CodeProject, 503-250 Ferrand Drive Toronto Ontario, M3C 3G8 Canada +1 416-849-8900 x 100 Therefore the compiler complains when trying to parse the includes in the order you gave them. Some error messages are consequences of problems elsewhere and the messages are not always in a revealing order.  But with practice, you'll develop an error-location and correction methodology that works for

This documentation is archived and is not being maintained. Solution 1 Accept Solution Reject Solution Quote:main() should be int main() Permalink Posted 5-May-13 21:32pm CPallini390.3K Rate this: Please Sign up or sign in to vote. Privacy statement Help us improve MSDN. No new replies allowed.

share|improve this answer answered Mar 3 '13 at 14:07 Zdeslav Vojkovic 11k927 add a comment| up vote 1 down vote I don't believe you need the extra int in the typedef,