Home > Error C4430 > Error C4430 Msdn

Error C4430 Msdn

Contents

Page 1 of 1 (2 posts) Previous Discussion Next Discussion Need Help?Terms of UsePrivacy & CookiesCode of Conduct © 2016 Microsoft Corporation All rights reserved Ogre Forums Support and community hang-out Privacy statement Help us improve MSDN. https://technet.microsoft.com/en-us/library/bb896645.aspx I seem to recall I had some registry settings that didn't roll over as expected. iRobo Posts: 26Joined: Mon Aug 23, 2010 1:41 pmLocation: Iran Website Top by hybrid » Thu Dec 02, 2010 8:59 am Well, simply enable it and recompile the engine. http://oncarecrm.com/error-c4430/error-c4430-int.html

I searched internet, but didn't get anything useful. Historically you would set the INCLUDE and LIB paths so that the DXSDK_DIR was first, but that only worked when the DirectX SDK headers were current. asked 6 years ago viewed 8409 times active 6 years ago Related -8Error c4430 ? Node.js LevelDB member No9 commented Jul 29, 2015 @mafintosh yup N.B. https://msdn.microsoft.com/en-us/library/ms173696.aspx

Error C4430 Missing Type Specifier

Color scheme by ColorizeIt! Can't figure out what the error is here help with the error c4430........ You may also post general programming questions here. We recommend upgrading to the latest Safari, Google Chrome, or Firefox.

Some error messages are consequences of problems elsewhere and the messages are not always in a revealing order.  But with practice, you'll develop an error-location and correction methodology that works for This MSDN article explains more about Compiler Warning C4430 and what you need to do to fix it:http://msdn2.microsoft.com/en-us/library/ms173696.aspx KristenNational Instruments 0 Kudos Message 2 of 2 (7,361 Views) Reply 0 Kudos You’ll be auto redirected in 1 second. Error C4430 C++ Very bad juju.

C4430 is always issued as an error. Does anyone know what this means? See ASP.NET Ajax CDN Terms of Use – http://www.asp.net/ajaxlibrary/CDN.ashx. ]]> Developer Network Developer Network Developer :CreateViewProfileText: Sign in MSDN code ELIFECYCLE npm ERR!

Node.js LevelDB member No9 commented Sep 9, 2015 Hi @jkrot If we are still talking about the EPERM I haven't been able to replicate this nor I have I seen first Error C4430: Missing Type Specifier - Int Assumed. Note: C++ Does Not Support Default-int node-gyp -v v2.0.2 gyp ERR! Note: C++ does not support default-int [c:\Users\prebuild\leveldown\build\leveldown.vcxproj] c:\Users\prebuild\.node-gyp\2.4.0\deps\v8\include\v8.h(3949): error C2864: 'v8::PropertyHandlerFlags::kNone' : only static const integral data members can be initialized within a class [c:\Users\prebuild\leveldown\build\leveldown.vcxproj] c:\Users\prebuild\.node-gyp\2.4.0\deps\v8\include\v8.h(3949): error C4430: missing type specifier Terms Privacy Security Status Help You can't perform that action at this time.

Error C4430 Visual C++

Note: C++ does not support default-int [c:\Users\prebuild\leveldown\build\leveldown.vcxproj] c:\Users\prebuild\.node-gyp\2.4.0\deps\v8\include\v8.h(3949): error C2864: 'v8::PropertyHandlerFlags::kNone' : only static const integral data members can be initialized within a class [c:\Users\prebuild\leveldown\build\leveldown.vcxproj] c:\Users\prebuild\.node-gyp\2.4.0\deps\v8\include\v8.h(3949): error C4430: missing type specifier Get More Info See this blog post. Error C4430 Missing Type Specifier Reload to refresh your session. Error C4430 Visual Studio I can't compilethe C++2005 project(error C4430: C++ does not support default-int).

Also tried latest node 0.12.7, where it installed correctly. weblink All rights reserved. 418,505 Members | 2,696 Online Join Now login Ask Question Home Questions Articles Browse Topics Latest Top Members FAQ home > topics > c / c++ Thanks in advance. 8/7/2014 3:54 PM In reply to Charybdis (2996) XNA Team Posts 942 Re: Weird Errors C2146 and C4430 in d3d11shader.h Answer Reply Quote Your problem is most likely Aug 6 '10 #1 Post Reply Share this Question 1 Reply Expert Mod 5K+ P: 8,916 Banfa If you googled "C4430" then the first link would be http://msdn.microsoft.com/en-us/libr...8VS.80%29.aspx which is Microsofts Error C4430 Missing Type Specifier - Int Assumed

Note: C++ does not support default-int [c:\Users\prebuild\leveldown\build\leveldown.vcxproj] c:\Users\prebuild\.node-gyp\2.4.0\deps\v8\include\v8.h(3949): error C2864: 'v8::PropertyHandlerFlags::kAllCanRead' : only static const integral data members can be initialized within a class [c:\Users\prebuild\leveldown\build\leveldown.vcxproj] c:\Users\prebuild\.node-gyp\2.4.0\deps\v8\include\v8.h(3949): error C2143: syntax error : Or should I be testing something else specifically Node.js LevelDB member mafintosh commented Jul 29, 2015 @No9 is this on Windows 7 64bit? Note: C++ does not support default-int C:\Program Files\Microsoft SDKs\Windows\v6.0A\include\winnt.h 7818 Irrlicht
Error 6 error C2146: syntax error : missing ';' before identifier 'PVOID64' C:\Program Files\Microsoft SDKs\Windows\v6.0A\include\winnt.h 236 Irrlicht
Error 7 error navigate here When I tried to compile the first demo(It's just a simple one to show you how to initialize a D3D object) in VS2012, the compiler gave me errors in d3d11shader.h.So I

Wednesday, June 13, 2007 9:46 AM 0 Sign in to vote  AtulThosar wrote: Is there any way in Visual C++ 2005 to suppress this effect ? Error C2143: Syntax Error : Missing ',' Before '&' c++ visual-c++ syntax-error share|improve this question edited May 26 '10 at 20:53 Alan 26.6k1280113 asked May 26 '10 at 20:49 Nick Heiner 35.9k113366616 add a comment| 5 Answers 5 active oldest If you just have 2013 installed then you shouldn't have to worry about the --msvs-version=2013 stuff.

Note: C++ does not support default-intThis error can be generated as a result of compiler conformance work that was done for Visual C++ 2005: all declarations must explicitly specify the type;

stack at ChildProcess.onExit (c:\Users\prebuild\AppData\Roaming\npm\node_modules\node-gyp\lib\build.js:269:23) gyp ERR! Note: C++ does not support default-int" I am completely new to C++.   I'd appreciate if could help me spot the source of my error in the following program:

As Jonathan already reported, If you choose to participate, the online survey will be presented to you when you leave the Msdn Web site.Would you like to participate? C++ Does Not Support Default-int C4430 Then I did … compiler error 7 replies I'm receiving this error when I'm trying to run my program: Program received signal: “EXC_BAD_ACCESS”.

prebuild ERR! Hope this helps @mafintosh Node.js LevelDB member mafintosh commented Jul 29, 2015 @No9 do i have to use the --msvs-version=2013 flag when compiling with node-gyp? (i am a windows noob :)) WARN install Module did not self-register), which tells me somehow you are getting the wrong binary for your system. his comment is here Note: C++ does not support default-int c:\program files (x86)\windows kits\8.0\include\um\d3d11shader.h 54Could someone please help me with it?

But there are always other things to do :/ Node.js LevelDB member mafintosh commented Jul 29, 2015 Dang. I want it to give an error message if the file does not exist (or has a … About Us Contact Us Donate Advertising Vendor Program Terms of Service © 2002 code ELIFECYCLE Nothing is set as read only. Note: C++ does not support default-int" I am completely new to C++.   I'd appreciate if could help me spot the source of my error in the following program:

As Jonathan already reported,

Tenant claims they paid rent in cash and that it was stolen from a mailbox. stack at emitTwo (events.js:87:13) gyp ERR! You probably meant to place an operator of some sort between those two operands. Did you forget a ';'? [c:\Users\prebuild\leveldown\build\leveldown.vcxproj] c:\Users\prebuild\.node-gyp\2.4.0\deps\v8\include\v8.h(3949): error C3381: 'v8::PropertyHandlerFlags' : assembly access specifiers are only available in code compiled with a /clr option [c:\Users\prebuild\leveldown\build\leveldown.vcxproj] c:\Users\prebuild\.node-gyp\2.4.0\deps\v8\include\v8.h(3949): error C4430: missing type specifier

Do you guys have any idea that can help me? With VS 2012's "v110" or VS 2013's "v120" Platform Toolset, if you also need to use the DirectX SDK, you use VC++ Directory settings for Include and Lib of: $(IncludePath);$(DXSDK_DIR)Include   build EPERM: operation not permitted, unlink 'D:\test\node_modules\leveldown\build\Release\leveldown.node' npm ERR! argv "C:\\Program Files (x86)\\iojs\\node.exe" "C:\\Program Files (x86) \\iojs\\node_modules\\npm\\bin\\npm-cli.js" "install" "leveldown" npm ERR!

You can fix the error by explicitly stating the return type. Include the string header file: #include 2. Any compilation flag or any other settings ?Since I am compiling a huge  code base in Visual C++ 2005 which runs fine on Visual C++ 2003So making changes in every file Browse more C / C++ Questions on Bytes Question stats viewed: 1387 replies: 1 date asked: Aug 6 '10 Follow this discussion BYTES.COM 2016 Formerly "TheScripts.com" from 2005-2008 About Bytes

devc++ 10 replies Hey guys Here's my code that is giving me a compiler error ? jkrot commented Aug 21, 2015 Thats just a timeout with express because another dependency failed. It's driving me crazy so any help is appreciated here. I just started to learn Direct3D 11 using the book Introduction to 3D Game Programming with DirectX11 by Frank Luna. Note: C++ does not support default-int [c:\Users\prebuild\leveldown\build\leveldown.vcxproj] c:\Users\prebuild\.node-gyp\2.4.0\deps\v8\include\v8.h(3949): error C2864: 'v8::PropertyHandlerFlags::kNone' : only static const integral data members can be initialized within a class [c:\Users\prebuild\leveldown\build\leveldown.vcxproj] c:\Users\prebuild\.node-gyp\2.4.0\deps\v8\include\v8.h(3949): error C4430: missing type specifier