Home > Error C4430 > Error C4430 Missing Type

Error C4430 Missing Type

Contents

For VS2005 onwards, the compiler will no longer make any assumptions in these sorts of cases and will quite correctly flag an error. Join them; it only takes a minute: Sign up error C4430: missing type specifier - int assumed up vote 0 down vote favorite I'm getting an error on Line 266. Not the answer you're looking for? Where and how is GetAge() declared? Victor Nijegorodov Reply With Quote November 4th, 2010,05:53 PM #3 Eri523 View Profile View Forum Posts Elite Member Join Date Jun 2010 Location Germany http://oncarecrm.com/error-c4430/error-c4430-missing-type-specifier-ctlutil-h.html

And please use code tags. Not the answer you're looking for? Note: C++ does not support default-int c:\x\dcd\dcdchild.h 22 1-3error C4430: missing type specifier - int assumed. It seems you include Initialization.h which uses DWORDLONG but that has not been defined yet. http://stackoverflow.com/questions/23283080/error-c4430-missing-type-specifier-int-assumed

Error C4430 Missing Type Specifier Int Assumed Note C++

All that leads me to the conclusion that it is not your actual code that you've posted here, otherwise you certainly would have got some more errors. You can turn off this warning with the #pragma warning or /wd; see warning or /w, /Wn, /WX, /Wall, /wln, /wdn, /wen, /won (Warning Level) for more information.ExampleThe following sample generates I know I'm confused why its there. –user1797587 Sep 2 '13 at 21:28 Post a complete example that exhibits the error. –Alan Stokes Sep 2 '13 at 21:37

Why is there a white line in Russian fighter jets canopy? No matter, locate this line and actually declare the variable with appropriate type. —SA Volynsky Alex 6-May-13 3:28am Do not see the class declaration pcap_if_t.... When answering a question please: Read the question carefully. Missing Type Specifier - Int Assumed C++ Does Not Support Default-int If this is your first visit, be sure to check out the FAQ by clicking the link above.

Note: C++ does not support default-int-1error C4430 c++ : missing type specifier - int assumed0missing type specifier - int assumed C4430 error0error C4430: missing type specifier - int assumed0srand(time(NULL)): error C4430: Error C4430 Visual C++ Sign in using Search within: Articles Quick Answers Messages Use my saved content filters home articles Chapters and Sections> Search Latest Articles Latest Tips/Tricks Top Articles Beginner Articles Technical Blogs Posting/Update This compiled correctly in vs 2003 but doesnt … Homework due tonight, can't figure it out! "error C2143: syntax error : missing ';' 4 replies When declaring get_color and get_size, my http://stackoverflow.com/questions/17825585/error-c4430-missing-type-specifier WorldSession.h(266): error C4430: missing type specifier - int assumed.

Here is the code. Error C4430 Missing Type Specifier C++ Optional Password I have read and agree to the Terms of Service and Privacy Policy Please subscribe me to the CodeProject newsletters Submit your solution! I am getting all these errors when I try to #include one of the header file. Problems with "+" in grep A power source that would last a REALLY long time Foldable, Monoid and Monad Vertical align top in multicolumn What is the difference between Mean Squared

Error C4430 Visual C++

mathueie 20 posts since Apr 2009 Community Member 6Contributors 8Replies 17Views 7 YearsDiscussion Span 7 Years Ago Last Post by mathueie 0 Sky Diploma 571 7 Years Ago This mostly appears https://msdn.microsoft.com/en-us/library/ms173696.aspx in VS 2003 and earlier, the above code would compile correctly without errors or warnings, but in VS 2005 onwards you'll get the C4430 error/warning message. Error C4430 Missing Type Specifier Int Assumed Note C++ worldvolution 2015-01-08 12:41:04 UTC #3 Thanks, I tried it, but it seems to return more syntax errors. Error C4430 Visual Studio Jochen Arndt 6-May-13 4:15am It is a handler function that must be implemented by you.

This means you need to define it before you can use it. his comment is here What is the definition of function in ZF/ZFC? c++ compiler-errors share|improve this question edited Dec 7 '15 at 10:51 Vlad from Moscow 1 asked Nov 27 '13 at 18:57 A.M.Rashed Mahamud 1111 Please avoid using tabs. Is there a way to prevent developers from using std::min, std::max? Mfc Error C4430

Identifying a Star Trek TNG episode by text passage occuring in Carbon Based Lifeforms song "Neurotransmitter" How to automatically run a command after exiting ssh What is the meaning and etymology error C4430: missing type specifier - int assumed. Application Lifecycle> Running a Business Sales / Marketing Collaboration / Beta Testing Work Issues Design and Architecture ASP.NET JavaScript C / C++ / MFC> ATL / WTL / STL Managed C++/CLI http://oncarecrm.com/error-c4430/error-c4430-missing.html Join them; it only takes a minute: Sign up Error 1 error C4430: missing type specifier - int assumed.

main(){//Causes the error int main(){//No Error, Though that is pretty generalised, Hope its the same error, -------------------------------------------------- CPU.cpp file ----------------------------------------------------- #include "StdAfx.h" #include "cpu.h" #include #include TKLong CPU::s_time = Error C4430 C++ asked 3 years ago viewed 3681 times active 3 years ago Related -1error C4430 c++ : missing type specifier - int assumed0missing type specifier - int assumed C4430 error0srand(time(NULL)): error C4430: No new replies allowed.

Does the string "...CATCAT..." appear in the DNA of Felis catus?

Note: C++ does not support default-int-3error C4430: missing type specifier - int assumed. From what I understand of this (I have encountered it before): In MS's attempts to make VS2005 more conformable to the standard, VS2005 onwards requires all variables, parameters and return types Hot Network Questions Can two different firmware files have same md5 sum? Missing Type Specifier - Int Assumed String So just add the function as done there.

share|improve this answer edited Jul 24 '13 at 5:21 answered Jul 24 '13 at 5:11 Chris 3,47812457 That could rather be a comment –0decimal0 Jul 24 '13 at 5:13 What happens if anti-refelctive coating is fully ruined or removed from lens most outer surface? Results 1 to 8 of 8 Thread: Error C4430: missing type specifier - int assumed. navigate here Note: C++ does not support default-int2string not recongnized ??

How to challenge optimized player with Sharpshooter feat What is the difference between SAN and SNI SSL certificates? Reply With Quote November 4th, 2010,05:55 PM #4 Zlatomir View Profile View Forum Posts Member Join Date Aug 2009 Location Romania->Felnac Posts 48 Re: Error C4430: missing type specifier - int Therefore the compiler complains when trying to parse the includes in the order you gave them. Because main() must return an int, use: int main() { // ...

Note: C++ does not support default-int (..\Classes\Prisoner.cpp) f:\documents\apps\prisonbreak\classes\playscene.h 11 1 PrisonBreak > Error 3 error C2143: syntax error : missing ';' before '*' (..\Classes\Prisoner.cpp) f:\documents\apps\prisonbreak\classes\playscene.h 15 1 PrisonBreak > Error 4 Note: C++ does not support default-int Home Categories FAQ/Guidelines Terms of Service Privacy Policy Powered by Discourse, best viewed with JavaScript enabled CodeGuru Home VC++ / MFC / C++ .NET / Why I failed to use the \foreach command to connect the points? C:\Program Files\Microsoft SDK XPSP2\Include\ObjBase.h(378) : error C2146: syntax error : missing ';' before identifier 'IRpcStubBuffer' C:\Program Files\Microsoft SDK XPSP2\Include\ObjBase.h(378) : error C2079: 'IRpcStubBuffer' uses undefined struct 'IRpcStubBuffer' C:\Program Files\Microsoft SDK XPSP2\Include\ObjBase.h(379)

In a file called grades.h I have 1
2
3
4
5
struct grades { string studentname; string classname; char lettergrade; }; In main I have 1
2
3
4
5
6
7
8
9
10
11
12
13
14
15
16
17
18
19
20
21
22
#include #include #include #include "grades.h" missing a } somewhere. –Alexandru Barbarosie Sep 2 '13 at 21:28 @Alexandru Barbarosie, no other file is included on this header file. Note: C++ does not support default-int - Prev solutions not working Hot Network Questions Why are three-bladed helicopters relatively rare? in what source file does this happen. –yzt Sep 2 '13 at 21:48 | show 2 more comments Your Answer draft saved draft discarded Sign up or log in Sign

Three rings to rule them all (again) What news about the second Higgs mode (or the mysterious particle) is anticipated to be seen at LHC around 750 GeV? You may have to register or Login before you can post: click the register link above to proceed. Reply With Quote November 4th, 2010,06:36 PM #7 newbe1 View Profile View Forum Posts Junior Member Join Date Oct 2010 Posts 15 Re: Error C4430: missing type specifier - int assumed. People.h #pragma once #include "cocos2d.h" class PlayScene; People.cpp #include "People.h" #include "Definition.h" #include "PlayScene.h" PlayScene.h #pragma once #include "People.h" #include "cocos2d.h" #include "Definition.h" JENNYHUI 2015-04-29 00:36:23 UTC #7 include include /*

Why can't alcohols form hydrogen-bonded dimers like carboxylic acids? Hope this is of some help!