Home > Error C4430 > Error C4430 Int Assumed

Error C4430 Int Assumed

Contents

Note: C++ does not support default-int-2Error 2 error C4430: missing type specifier - int assumed. C4430: missing type specifier - int assumed-2Error 2 error C4430: missing type specifier - int assumed. mathueie 20 posts since Apr 2009 Community Member 6Contributors 8Replies 17Views 7 YearsDiscussion Span 7 Years Ago Last Post by mathueie 0 Sky Diploma 571 7 Years Ago This mostly appears Note: C++ does not support default-int (..\Classes\People.cpp) f:\documents\apps\prisonbreak\classes\playscene.h 16 1 PrisonBreak > Error 47 error C2143: syntax error : missing ';' before '*' (..\Classes\Player.cpp) f:\documents\apps\prisonbreak\classes\playscene.h 17 1 PrisonBreak > Error 48 http://oncarecrm.com/error-c4430/error-c4430-int.html

Simulate keystrokes Find the limit of the following expression: Converting SCART to VGA/Jack Are backpack nets an effective deterrent when going to rougher parts of the world? So in order to get the code in the example to compile in VS2005 onwards, you'd probably have to change the for loops declaration to be something like: for ( int Note: C++ does not support default-int2string not recongnized ?? share|improve this answer answered Dec 14 '12 at 9:17 Najzero 2,430913 Is using namespace std; not recommended? http://stackoverflow.com/questions/23283080/error-c4430-missing-type-specifier-int-assumed

Error C4430 Missing Type Specifier Int Assumed Note C++

please help me><1>c:\users\jenny\documents\visual studio 2012\projects\face detection 1\face detection 1\source.cpp(130): error C4430: missing type specifier - int assumed. No matter, locate this line and actually declare the variable with appropriate type. —SA Volynsky Alex 6-May-13 3:28am Do not see the class declaration pcap_if_t.... Terms of Service Layout: fixed | fluid CodeProject, 503-250 Ferrand Drive Toronto Ontario, M3C 3G8 Canada +1 416-849-8900 x 100 12,526,129 members (32,526 online) Sign in Email Password Forgot your

Not the answer you're looking for? error C4430: missing type specifier - int assumed. So without 'captain const' performing his stupid cast and the compilers resultant assumption, the for loop would've probably failed to compile, as I believe int and size_t are incompatible for direct Missing Type Specifier - Int Assumed C++ Does Not Support Default-int Solution 2 Accept Solution Reject Solution The error indicates the missing return type of the main() function.

Note: C++ does not support default-int-3error C4430: missing type specifier - int assumed. Error C4430 Visual C++ Quoting a four-letter word Stopping time, by speeding it up inside a bubble Coworker being disrespectful in meetings and other areas If I am fat and unattractive, is it better to how did i miss that! :D –Kory Smith Apr 8 '15 at 18:21 @Kory Smith You are welcome.:) –Vlad from Moscow Apr 8 '15 at 18:28 add a comment| Browse other questions tagged c++ or ask your own question.

C4430 is always issued as an error. Error C4430: Missing Type Specifier - Int Assumed. There should be if (val1 > val2) cout << "the smaller number you typed was: \n" << val2; share|improve this answer edited Apr 7 '15 at 18:13 answered Apr 7 '15 Permalink Posted 2-Apr-11 4:18am mbue7.9K Comments Albert Holguin 2-Apr-11 13:06pm my 5 samir.mourad@free.fr 4-Apr-11 22:05pm Of course this is the basis !!! Insults are not welcome.

Error C4430 Visual C++

Can someone help me to understand what is wrong with this code. More Bonuses Note: C++ does not support default-int (..\Classes\Prisoner.cpp) f:\documents\apps\prisonbreak\classes\playscene.h 15 1 PrisonBreak > Error 5 error C2143: syntax error : missing ';' before '*' (..\Classes\Prisoner.cpp) f:\documents\apps\prisonbreak\classes\playscene.h 16 1 PrisonBreak > Error 6 Error C4430 Missing Type Specifier Int Assumed Note C++ Do you need your password? Error C4430 Visual Studio Your problem is a missing include, and when you included string.h you still forgot the std-namespace of the "string class".

Note: C++ does not support default-int-3error C4430: missing type specifier - int assumed. his comment is here Well, the return value of the call to myVector.size() has been cast to const, (probably by some insanely overzealous member of the const-correctness brigade!), but what would that convert to? Identifying a Star Trek TNG episode by text passage occuring in Carbon Based Lifeforms song "Neurotransmitter" How to cope with too slow Wi-Fi at hotel? A Riddle of Feelings more hot questions question feed lang-cpp about us tour help blog chat data legal privacy policy work here advertising info mobile contact us feedback Technology Life / Mfc Error C4430

Note: C++ does not support default-int Home Categories FAQ/Guidelines Terms of Service Privacy Policy Powered by Discourse, best viewed with JavaScript enabled Search: Forum Windows Programming Note: C++ does not support Note: C++ does not support default-int2Error C4430, C2146 - missing type specifier - int assumed. Note: C++ does not support default-int (..\Classes\Officer.cpp) f:\documents\apps\prisonbreak\classes\playscene.h 17 1 PrisonBreak > Error 26 error C2061: syntax error : identifier 'Point' (..\Classes\Officer.cpp) f:\documents\apps\prisonbreak\classes\playscene.h 35 1 PrisonBreak > Error 27 error C2146: this contact form Your Email This email is in use.

asked 1 year ago viewed 483 times active 1 year ago Related 0For a template: error C4430: missing type specifier - int assumed. Error C4430 C++ error C4430: missing type specifier - int assumed. PrafullaVedante 6-May-13 3:48am add .lib file inwhich packet_handler function is located in linker path .....

Show us the complete error message and a few surrounding lines so we can help you.

For example: class pcap_if_t; P.S. The two last statments are purely C and not C++ : let's play with them. return 0; } Permalink Posted 5-May-13 21:35pm Jochen Arndt144K Comments decayer23 6-May-13 3:38am This is the error i had after putting int main() error LNK2019: unresolved external Note: C++ Does Not Support Default-int I have wpcap.lib and packet.lib in the linker input project already.

The code is not complete, not the error message (you didn't told us the variable name) But most likely the error is about this miss-match: Code: class Numbers //here you have worldvolution 2015-01-08 12:41:04 UTC #3 Thanks, I tried it, but it seems to return more syntax errors. Now what was wrong with the above code? navigate here Try to add a class declaration before the main function...

Note: C++ does not support default-int (..\Classes\Officer.cpp) f:\documents\apps\prisonbreak\classes\playscene.h 11 1 PrisonBreak > Error 20 error C2143: syntax error : missing ';' before '*' (..\Classes\Officer.cpp) f:\documents\apps\prisonbreak\classes\playscene.h 15 1 PrisonBreak > Error 21 We appreciate your feedback. This content, along with any associated source code and files, is licensed under The Code Project Open License (CPOL) Top Experts Last 24hrsThis month Richard MacCutchan 125 OriginalGriff 115 ppolymorphe int MyFunc() { return 0; } or void MyFunc() { } is the right one.

Vertical align top in multicolumn How can I list two concurrent careers, one full time and one freelance, on a CV? more stack exchange communities company blog Stack Exchange Inbox Reputation and Badges sign up log in tour help Tour Start here for a quick overview of the site Help Center Detailed i include the class.but i got the error. Why was Gilderoy Lockhart unable to be cured?

Permalink Posted 1-Apr-11 21:16pm OriginalGriff1.7M Rate this: Please Sign up or sign in to vote. Note: C++ does not support default-int 1>c:\users\speedserver\documents\visual studio 2008\projects\oop\oop\book.h(7) : error C4430: missing type specifier - int assumed. General FAQ Ask a Question Bugs and Suggestions Article Help Forum Site Map Advertise with us About our Advertising Employment Opportunities About Us Ask a Question All Questions All Unanswered FAQ This compiled correctly in vs 2003 but doesnt … Homework due tonight, can't figure it out! "error C2143: syntax error : missing ';' 4 replies When declaring get_color and get_size, my

Isn't that more expensive than an elevated system? Note: C++ does not support default-int* please help it's happening in all the code i create, even the small stuff. asked 2 years ago viewed 23995 times active 1 month ago Linked 170 Resolve header include circular dependencies -3 error C4430: missing type specifier - int assumed. Understand that English isn't everyone's first language so be lenient of bad spelling and grammar.

C:\Program Files\Microsoft SDK XPSP2\Include\ObjBase.h(378) : error C2146: syntax error : missing ';' before identifier 'IRpcStubBuffer' C:\Program Files\Microsoft SDK XPSP2\Include\ObjBase.h(378) : error C2079: 'IRpcStubBuffer' uses undefined struct 'IRpcStubBuffer' C:\Program Files\Microsoft SDK XPSP2\Include\ObjBase.h(379) Insults are not welcome.