Home > Error C4430 > Error C4430 Class

Error C4430 Class

Contents

Note: C++ does not support default-int Home Categories FAQ/Guidelines Terms of Service Privacy Policy Powered by Discourse, best viewed with JavaScript enabled Unreal Engine Forums > Development Discussion > C++ Gameplay share|improve this answer answered Sep 27 '10 at 18:11 BatchyX 3,17911117 1 +1 for actually showing the result. –GManNickG Sep 27 '10 at 18:14 add a comment| up vote 3 Getting Error C4430 C++ Help; Can't Figure Out What's Wrong With Code... - Theature Seating Error C4430 & C2143 C++ Classes Error Error C4430 Please Help With Homework - All Done i have this - #include using namespace std; template class Number { public: Number(T n) { _num = n; } ~Number() { } bool isEqual(T n) { if(_num this contact form

If you choose to participate, the online survey will be presented to you when you leave the Msdn Web site.Would you like to participate? Thats because, from compiler point of view, pointers or references are just 4 bytes irrespective of the class contents. And also point out where in the source you have those errors.Also, what is m_LottoBerechnung? –Joachim Pileborg Jul 5 '13 at 8:05 Also, check your semicolons before the declaration Note: C++ does not support default-int1Template Class: error C4430: missing type specifier - int assumed. http://stackoverflow.com/questions/17483960/error-c4430-object-classes

Error C4430 Missing Type Specifier

Note: C++ does not support default-int Archived Forums V > Visual C++ MFC and ATL Question 0 Sign in to vote Hi! Generating Random Numbers - The C++ Way Hello World: Your first C and C++ Programs Network programming under UNIX Implementation Inheritance Change Theme in Code::Blocks A New Webcam Api Tutorial in Question on the Sato-Tate conjecture Should spoilers and reverse thrust be deployed before nose gear touches down? Simulate keystrokes What are the drawbacks of the US making tactical first use of nuclear weapons against terrorist sites?

Then they won't have to mutually depend on each other. May I know what error is this? Visit our UserVoice Page to submit and vote on ideas! Error C4430 Missing Type Specifier Int Assumed Note C++ What is the meaning and etymology of "cod-French" accent?

Note: C++ does not support default-int (..\Classes\Officer.cpp) f:\documents\apps\prisonbreak\classes\playscene.h 16 1 PrisonBreak > Error 24 error C2143: syntax error : missing ';' before '*' (..\Classes\Officer.cpp) f:\documents\apps\prisonbreak\classes\playscene.h 17 1 PrisonBreak > Error 25 Error C4430 Visual C++ Note: C++ does not support default-int error C2061: syntax error : identifier 'MenuNode' May I know why and how to solve it? I have type the codes as below: class MenuTree { public: MenuTree(void); ~MenuTree(void); MenuNode *node; int InsertNode(void); protected: int InsertNodeEx(MenuNode *Root); }; class MenuNode { private: int m[10]; public: MenuNode(void); ~MenuNode(void); http://stackoverflow.com/questions/23283080/error-c4430-missing-type-specifier-int-assumed Note: C++ does not support default-int (..\Classes\People.cpp) f:\documents\apps\prisonbreak\classes\playscene.h 11 1 PrisonBreak > Error 39 error C2143: syntax error : missing ';' before '*' (..\Classes\Player.cpp) f:\documents\apps\prisonbreak\classes\playscene.h 15 1 PrisonBreak > Error 40

Can anyone explain why my normals have a mind of their own When must I use #!/bin/bash and when #!/bin/sh? Error C4430 C++ Can two different firmware files have same md5 sum? Asking Client for discount on Ticket to amusement park The need for the Gram–Schmidt process As a non root user, I'm able to delete a file made by root with 0444 I am getting all these errors when I try to #include one of the header file.

Error C4430 Visual C++

The forward declaration is sufficient if all you want is a reference. –Michael Kristofik Sep 27 '10 at 18:18 In the ctor im using a getter functions of the Can Klingons swim? Error C4430 Missing Type Specifier error LNK2019: unresolved external symbol "public: __thiscall MenuNode::MenuNode(void)" Thanks! Error C4430 Visual Studio RegMatrix(const SparseMatrix &s){...} //ctor ... }; #endif SparseMatrix.h: #ifndef _SM_H #define _SM_H #include "RegMatrix.h" ...

But you can usually clear up any problems with intellisense (albeit temporarily) by closing your solution, deleting it's corresponding intellisense database and then reopening the solution. weblink Note: C++ does not support default-int (..\Classes\Player.cpp) f:\documents\apps\prisonbreak\classes\playscene.h 39 1 PrisonBreak > Error 55 error C2146: syntax error : missing ';' before identifier 'tileCoordForPosition' (..\Classes\People.cpp) f:\documents\apps\prisonbreak\classes\playscene.h 39 1 PrisonBreak > Error Ask a question Quick access Forums home Browse forums users FAQ Search related threads Remove From My Forums Answered by: error C4430: missing type specifier - int assumed. Can anyone explain why my normals have a mind of their own Why I failed to use the \foreach command to connect the points? Mfc Error C4430

Declaring the class name allows you to use the name without having to know about the internal bits of the class. A problem on integrals I don't want to get lung cancer like you do What is the definition of function in ZF/ZFC? Such as: //B.h class A; // change the include of A.h to forward declaration class B { A* a; }; share|improve this answer edited Apr 26 '14 at 1:08 answered Apr navigate here Physically locating the server Simulate keystrokes What is the definition of function in ZF/ZFC?

You should read the documentation for UpdateData and DoDataExchange to better understand how MFC is doing data exchange from/to dialog controls. Missing Type Specifier - Int Assumed String You can't do anything about it. Without the empty member list, the class would have an incomplete declaration, which would not allow any objects of it to be declared. 0 Discussion Starter DaveTran 3 4 Years Ago

Could accessed sites over an SSH tunnel be tracked by ISP?

What is the success probability for which this is most likely to happen? Should I serve jury duty when I have no respect for the judge? Also try restarting XCode. Note C++ Does Not Support Default Int Note: C++ does not support default-int 1>D:\Unreal Engine\Epic Games\4.8\Engine\Source\Runtime\Engine\Classes\Interfaces/Interface_PostProcessVolume.h(15): error C2143: syntax error : missing ';' before '*' 1>D:\Unreal Engine\Epic Games\4.8\Engine\Source\Runtime\Engine\Classes\Interfaces/Interface_PostProcessVolume.h(21): warning C4510: 'FPostProcessVolumeProperties' : default constructor could not be generated

It tells the compiler that "somehere" there is a class of that name. Note: C++ does not support default-int (..\Classes\Player.cpp) f:\documents\apps\prisonbreak\classes\playscene.h 16 1 PrisonBreak > Error 45 error C2143: syntax error : missing ';' before '*' (..\Classes\People.cpp) f:\documents\apps\prisonbreak\classes\playscene.h 16 1 PrisonBreak > Error 46 Game.h #include using namespace std; class Entity; class Game { public: list m_entities; Game(void); ~Game(void); void init(); void draw(float dt); void loadContent(); void update(float dt); } What's going on? http://oncarecrm.com/error-c4430/error-c4430-int.html You must forward declare one or both of them, like you did.

The code is simple and generated by UE and all it's doing is extending a post-process component. Note: C++ does not support default-int error C4430: missing type specifier - int assumed. C4430: missing type specifier - int assumed-2Error 2 error C4430: missing type specifier - int assumed. Is there a word in Esperanto for "lightsaber"?

Note: C++ does not support default-int (..\Classes\Prisoner.cpp) f:\documents\apps\prisonbreak\classes\playscene.h 15 1 PrisonBreak > Error 5 error C2143: syntax error : missing ';' before '*' (..\Classes\Prisoner.cpp) f:\documents\apps\prisonbreak\classes\playscene.h 16 1 PrisonBreak > Error 6 Likewise, where you are forward declaring the Entity class in Game.h you will need to include Entity.h in Game.cpp. Then SparseMatrix continues to be defined, except RegMatrix was never even declared. You can have empty constructorin some C++ file.

Note: C++ does not support default-int (..\Classes\Player.cpp) f:\documents\apps\prisonbreak\classes\playscene.h 17 1 PrisonBreak > Error 49 error C2143: syntax error : missing ';' before '*' (..\Classes\People.cpp) f:\documents\apps\prisonbreak\classes\playscene.h 17 1 PrisonBreak > Error 50 Note: C++ does not support default-int 1>D:\Dropbox\Work\Games\Projects\PluginDev\Plugins\CelShader\Intermediate\Build\Win64\UE4Editor\Inc\CelShader\CelShader.generated.cpp(14): error C4508: 'StaticRegisterNativesUCelShaderComponent' : function should return a value; 'void' return type assumed 1>D:\Dropbox\Work\Games\Projects\PluginDev\Plugins\CelShader\Intermediate\Build\Win64\UE4Editor\Inc\CelShader\CelShader.generated.cpp(15): error C2923: 'TClassCompiledInDefer' : 'UCelShaderComponent' is not a valid template It is a bi-direction association, i.e. One main Game class and an Entity class that needs to point to the Game class so it can call its various functions Entity.h class Game; class Entity { public: Entity(Game

Class - Missing Type Specifier Missing Type Specifier? Note: C++ does not support default-int (..\Classes\Officer.cpp) f:\documents\apps\prisonbreak\classes\playscene.h 17 1 PrisonBreak > Error 26 error C2061: syntax error : identifier 'Point' (..\Classes\Officer.cpp) f:\documents\apps\prisonbreak\classes\playscene.h 35 1 PrisonBreak > Error 27 error C2146: Could anyone help with this ? If those answers do not fully address your question, please ask a new question. 5 You need to do forward declaration of class A into the header file B.h before

Is the NHS wrong about passwords?