Home > Error C4430 > Error C4430 C

Error C4430 C

Contents

Note: C++ does not support default-int 1>c:\users\speedserver\documents\visual studio 2008\projects\oop\oop\book.h(15) : warning C4183: 'getAUTHOR': missing return type; assumed to be a member function returning 'int' 1>c:\users\speedserver\documents\visual studio 2008\projects\oop\oop\book.h(16) : error C2146: syntax E.g. This header file was included else where and it was fine. (Which rules out legitimate syntax errors.) However, when I try to include it in to this particular header file, it Reply With Quote December 19th, 2009,08:21 PM #11 RePrasad View Profile View Forum Posts Member Join Date Dec 2009 Posts 58 Re: C++ does not support default-int Thanks a lot Lindley! Check This Out

And also point out where in the source you have those errors.Also, what is m_LottoBerechnung? –Joachim Pileborg Jul 5 '13 at 8:05 Also, check your semicolons before the declaration What is the success probability for which this is most likely to happen? using visual studios 2013 express –Rehan Naqvi Mar 3 '13 at 14:02 Note: most compilers point out at the line the error message originated from, WHERE does the compiler Mar 3 '13 at 14:07 add a comment| 3 Answers 3 active oldest votes up vote 6 down vote accepted It has nothing to do with your typedef. http://stackoverflow.com/questions/15186416/c-compiler-error-c4430-c-doesnt-support-default-int

Error C4430 Visual C++

You should read the documentation for UpdateData and DoDataExchange to better understand how MFC is doing data exchange from/to dialog controls. There should be if (val1 > val2) cout << "the smaller number you typed was: \n" << val2; share|improve this answer edited Apr 7 '15 at 18:13 answered Apr 7 '15 Note: C++ does not support default-int 1>c:\users\speedserver\documents\visual studio 2008\projects\oop\oop\book.h(18) : error C4430: missing type specifier - int assumed. Install Setup not working Is the NHS wrong about passwords?

But the comiler tells you that default return values are not supported! Also try restarting XCode. more stack exchange communities company blog Stack Exchange Inbox Reputation and Badges sign up log in tour help Tour Start here for a quick overview of the site Help Center Detailed Missing Type Specifier - Int Assumed C++ Does Not Support Default-int C++ Information Tutorials Reference Articles Forum Forum BeginnersWindows ProgrammingUNIX/Linux ProgrammingGeneral C++ ProgrammingLoungeJobs Home page | Privacy policy© cplusplus.com, 2000-2016 - All rights reserved - v3.1Spotted an error?

This documentation is archived and is not being maintained. Terms Privacy Opt Out Choices Advertise Get latest updates about Open Source Projects, Conferences and News. Note: C++ does not support default-int - Prev solutions not working Hot Network Questions Is there a way to prevent developers from using std::min, std::max? What could possibly do that?

If you would like to refer to this comment somewhere else in this project, copy and paste the following link: Frank-Rene Schäfer - 2012-01-21 What is the value of the macro C4430 C++ No new replies allowed. Daniel-Hug commented Feb 5, 2015 I'm getting similar warnings & errors: > ws@0.4.32 install D:\Users\Daniel\Desktop\repos\Tiny-Finance\node_modules\karm a\node_modules\socket.io\node_modules\socket.io-client\node_modules\ws > (node-gyp rebuild 2> builderror.log) || (exit 0) D:\Users\Daniel\Desktop\repos\Tiny-Finance\node_modules\karma\node_modules\socke t.io\node_modules\socket.io-client\node_modules\ws>node "C:\Program Files\nodejs \node_modules\npm\bin\node-gyp-bin\\..\..\node_modules\node-gyp\bin\node-gyp.js" rebuild Building When stating a theorem in textbook, use the word "For all" or "Let"?

Error C4430 Missing Type Specifier

Note: C++ does not support default-int 1>c:\program files (x86)\quex\quex-0.60.2\quex\code_base\buffer\buffer(72): error C2061: syntax error : identifier 'uint8_t' 1>c:\program files (x86)\quex\quex-0.60.2\quex\code_base\buffer\buffer(78): error C2061: syntax error : identifier 'uint8_t' 1>c:\program files (x86)\quex\quex-0.60.2\quex\code_base\buffer\buffer(92): error C2143: http://www.cplusplus.com/forum/windows/51935/ Sign in using Search within: Articles Quick Answers Messages Use my saved content filters home articles Chapters and Sections> Search Latest Articles Latest Tips/Tricks Top Articles Beginner Articles Technical Blogs Posting/Update Error C4430 Visual C++ Do you need your password? Error C4430 Visual Studio I have added cstdint to my Forced headers in Project Properties as a work-around.

Should I serve jury duty when I have no respect for the judge? http://oncarecrm.com/error-c4430/error-c4430-directx.html Note: C++ does not support default-int 1>c:\program files (x86)\quex\quex-0.60.2\quex\code_base\buffer\buffer(23): error C2143: syntax error : missing ';' before '' 1>c:\program files (x86)\quex\quex-0.60.2\quex\code_base\buffer\buffer(23): error C4430: missing type specifier - int assumed. Your Email This email is in use. Take into account that your program outputs nothing in case when two entered numbers are equal each other. C4430 Missing Type Specifier - Int Assumed

Understand that English isn't everyone's first language so be lenient of bad spelling and grammar. This issue should be solved since longtime and I checked it by simulating with my gcc that the inclusion works propperly. Syntax Design - Why use parentheses when no arguments are passed? http://oncarecrm.com/error-c4430/error-c4430-int.html Albert Holguin 4-Apr-11 22:41pm what?

I found line 44 of file quex/code_base/compatibility/win/msc_stdint.h is now: include "stdint.h" After I change it to: include , the compilation is successful. Error C2143: Syntax Error : Missing ',' Before '&' If you would like to refer to this comment somewhere else in this project, copy and paste the following link: Alistair Leslie-Hughes - 2012-02-23 I can confirm that the correct fix Note: C++ does not support default-int2Error C4430, C2146 - missing type specifier - int assumed.

Note: C++ does not support default-int 1>c:\program files (x86)\quex\quex-0.60.2\quex\code_base\buffer\buffer(22): error C4430: missing type specifier - int assumed.

My adviser wants to use my code for a spin-off, but I want to use it for my own company 2048-like array shift What is the difference between SAN and SNI Note: C++ does not support default-int [C:\Users\Admin\nod e_modules\x509\build\x509.vcxproj] C:\Users\Admin\.node-gyp\0.11.9\src\node.h(195): error C4430: missing type specifier - int assumed. current community chat Stack Overflow Meta Stack Overflow your communities Sign up or log in to customize your list. Missing Type Specifier Int Assumed Template If you would like to refer to this comment somewhere else in this project, copy and paste the following link: Frank-Rene Schäfer - 2012-01-21 Sorry, are you saying _MSC_VER is defined

Note: C++ does not support default-int* please help it's happening in all the code i create, even the small stuff. Note: C++ does not support default-int 1>c:\users\speedserver\documents\visual studio 2008\projects\oop\oop\book.h(4) : error C4430: missing type specifier - int assumed. Note: C++ does not support default-int (..\Classes\People.cpp) f:\documents\apps\prisonbreak\classes\playscene.h 39 1 PrisonBreak > Error 59 error C2061: syntax error : identifier 'Point' (..\Classes\People.cpp) f:\documents\apps\prisonbreak\classes\playscene.h 39 1 PrisonBreak > Error 61 error C2061: navigate here Note: C++ does not support default-int 1>c:\program files (x86)\quex\quex-0.60.2\quex\code_base\buffer\buffer(23): error C4430: missing type specifier - int assumed.