Home > Error C > Error C Compiler Cannot Create Executables Solaris 10

Error C Compiler Cannot Create Executables Solaris 10

Contents

sparc-sun-solaris2.10 > checking host system type... Could accessed sites over an SSH tunnel be tracked by ISP? cc checking for C compiler default output file name... The existing apache 2.2.15 was compiled with m32 flag. have a peek here

So far everything checks out. The time now is 08:47 AM. Description littlestar 2008-05-26 00:24:49 UTC i386-pc-solaris2.10 configure: error: C compiler cannot create executables. At least for me it did. http://unix.stackexchange.com/questions/146402/configure-error-c-compiler-cannot-create-executables

Configure Error C Compiler Cannot Create Executables Solaris 10

Totally worked for me. Martin SourceForge About Site Status @sfnet_ops Powered by Apache Allura™ Find and Develop Software Create a Project Software Directory Top Downloaded Projects Community Blog @sourceforge Resources Help Site Documentation Support Request I don't actually have a gcc at this location: Code: [infobright01-dc2:~] root% ls -l /opt/sfw/bin/ curl curl-config libtool libtoolize rsync sudo top Which is why I installed this package from sunfreeware.com:

But for now: What's your rbenv install --version What's your llvm-gcc --version What's your xcode-select -print-path Does this help: xcode-select -switch /Applications/Xcode.app/Contents/Developer 👍 1 tellijo commented Sep 1, 2013 rbenv Thank you bluethundr View Public Profile View LQ Blog View Review Entries View HCL Entries Visit bluethundr's homepage! Following is the config.log generated: This file contains any messages produced by compilers while running configure, to aid debugging if configure makes a mistake. Configure Error C Compiler Cannot Create Executables Gentoo This looks more like a problem with your gcc installation than like a problem with msmtp.

Can a class instance variable be excluded from a subclass in Java? Error C Compiler Cannot Create Executables Ubuntu Main Menu LQ Calendar LQ Rules LQ Sitemap Site FAQ View New Posts View Latest Posts Zero Reply Threads LQ Wiki Most Wanted Jeremy's Blog Report LQ Bug Syndicate Latest yes checking for i386-pc-solaris2.10-gcc... /export/home/test/gcc-4.3.1-build/build/./gcc/xgcc -B/export/home/test/gcc-4.3.1-build/build/./gcc/ -B/opt/gcc-4.3.1/i386-pc-solaris2.10/bin/ -B/opt/gcc-4.3.1/i386-pc-solaris2.10/lib/ -isystem /opt/gcc-4.3.1/i386-pc-solaris2.10/include -isystem /opt/gcc-4.3.1/i386-pc-solaris2.10/sys-include -m64 checking for C compiler default output file name... If I build gcc 4.3.1 with --disable-multilib, I can only compile with apps with -m32?

Comment 8 littlestar 2008-05-29 04:50:39 UTC Created attachment 15697 [details] config.log config.log Comment 9 littlestar 2008-05-29 04:51:16 UTC configure:2540: checking for C compiler default output file name configure:2543: /export/home/test/gcc-4.3.1-build/build/./gcc/xgcc -B/export/home/test/gcc-4.3.1-build/build/./gcc/ -B/opt/gcc-4.3.1/i386-pc-solaris2.10/bin/ Configure Error C Compiler Cannot Create Executables Macports This site is not affiliated with Linus Torvalds or The Open Group in any way. Note that registered members see fewer ads, and ContentLink is completely disabled once you log in. Converting SCART to VGA/Jack Allow multiple GUI elements to react dynamically to interaction with a single element Simulate keystrokes Can 'it' be used to refer to a person?

Error C Compiler Cannot Create Executables Ubuntu

Sfpiano Linux - Software 9 12-11-2003 10:28 AM All times are GMT -5. https://community.activestate.com/forum/configure-error-c-compiler-cannot-create-executables Unix & Linux Stack Exchange works best with JavaScript enabled Latest LQ Deal: Complete CCNA, CCNP & Red Hat Certification Training Bundle Blogs Recent Entries Best Entries Best Blogs Blog List Configure Error C Compiler Cannot Create Executables Solaris 10 Can anyone explain why my normals have a mind of their own Proof of infinitely many prime numbers Identifying a Star Trek TNG episode by text passage occuring in Carbon Based Checking For C Compiler Default Output File Name Configure Error C Compiler Cannot Create Executables Already have an account?

Sun's C compiler is not installed by default AFAIK, it has to be bought separately. navigate here By joining our community you will have the ability to post topics, receive our newsletter, use the advanced search, subscribe to threads and access many other special features. There is NO warranty; not even for MERCHANTABILITY or FITNESS FOR A PARTICULAR PURPOSE. While running config.nice taken from apache2.2.15/build I am getting following error: checking whether the C compiler works... Configure Error C Compiler Cannot Create Executables See Config Log For More Details

What should I do? When must I use #!/bin/bash and when #!/bin/sh? configure: error: C compiler cannot create executables See `config.log' for more details. Check This Out gcc-4.2 checking for gcc... (cached) gcc-4.2 checking whether the C compiler works...

General Sun, SunOS and Sparc related questions also go here. Configure Error C Compiler Cannot Create Executables Python Heathrow to Gatwick and traffic jam TreePlot does not give a "binary-looking" tree for a binary tree Is there a word in Esperanto for "lightsaber"? Login to post comments tclInt.h roly.moroz | Thu, 2011-01-13 10:26 gcc was successfully installed but I hit another roadblock when building the expect command.

Is my teaching attitude wrong?

mislav commented Sep 1, 2013 This should be reported to the ruby-build project, where rbenv install comes from, which handles compiling Rubies. nawk > checking whether make sets $(MAKE)... yes > checking for a thread-safe mkdir -p... Configure Error C Compiler Cannot Create Executables Mac searching the web got me to try adding /usr/ccs/bin in order to locate the ld.so file (probably got to do with C++ Compiler or linker).

Notices Welcome to LinuxQuestions.org, a friendly and active Linux Community. But I have this error: BUILD FAILED Inspect or clean up the working tree at /var/folders/fn/1kz6tqdd2b58vl6lggn7ks4r0000gn/T/ruby-build.20130901135911.4559 Results logged to /var/folders/fn/1kz6tqdd2b58vl6lggn7ks4r0000gn/T/ruby-build.20130901135911.4559.log Last 10 log lines: checking build system type... Martin Thread view [msmtp-users] Compiler error - Solaris 10 From: Oggo Oggo - 2007-04-23 12:55:58 Hello! this contact form Briefly describe the problem (required): Upload screenshot of ad (required): Select a file, or drag & drop file here. ✔ ✘ Please provide the ad click URL, if possible: Home Browse

Comment 15 Rainer Orth 2011-07-18 17:45:29 UTC *** This bug has been marked as a duplicate of bug 33100 *** Format For Printing -XML -Clone This Bug -Top of page Home This is means that mingw build already broken, if root mingw directory differs from "mingw32" folder. nawk > checking whether make sets $(MAKE)... asked 5 years ago viewed 5133 times active 5 years ago Related 3Dealing with “C compiler cannot create executables” in Cygwin0How to modify options being passed to ld , without recompiling

c++ c gcc erlang solaris share|improve this question edited Jul 31 '11 at 11:17 asked Jul 31 '11 at 10:58 Muzaaya Joshua 5,34333065 Please post the relevant part of build-aux/install-sh -c checking whether build environment is sane... build-aux/install-sh -c checking whether build environment is sane... sparc-sun-solaris2.10 > checking for a BSD-compatible install...

nawk checking whether make sets $(MAKE)...